Diese Website existiert nur weil wir Werbung mit AdSense ausliefern.
Bitte den AdBlocker daher auf dieser Website ausschalten! Danke.

Wlan Treiber für Asus Adapter

Alles rund um das Internet, Internet-Anwendungen (E-Mail, Surfen, Cloud usw.) und das Einrichten von Netzwerken einschl. VPN unter Linux

Moderator: Moderatoren

Antworten
K4m1K4tz3
Advanced Hacker
Advanced Hacker
Beiträge: 987
Registriert: 19. Jan 2005, 13:54
Kontaktdaten:

Wlan Treiber für Asus Adapter

Beitrag von K4m1K4tz3 »

Ich habe mir vor kurtzem Suse 9.2 installiert. Jedoch habe ich ein Problem mit meinem WLAN. Da ich so gut wie keine Ahnung von Linux habe wende ich mich an euch und hoffe Ihr könnt mir helfen.

Mein WLAN-Adapter von Asus (WL-161) wird leider nicht richtig erkannt. Als ich auf der Asus Homepage nach einem Treiber für Linux gesucht habe fand ich auch einen passenden. Der Treiber hieß "SIS162-Driver". Daher denke ich mal, dass ein Chip von SiS mit dem Namen 162 eingebaut wurde. Als ich den Treiber installierte kam jedoch eine Fehlermeldung das er etwas nicht schreiben konnte, oder so ähnlich. Also suchte ich auf der Seite von SiS nach einem etwas ähnlichen Treiber und versuchte es mit dem "SiS160-Driver". Diesen konnte ich installieren jedoch erkennt das mit installierte Tool meinen Adapter nicht an. Jetzt bin ich etwas ratlos und weiß nicht mehr was ich sonst noch machen soll. Zudem habe ich seitdem keinen einzigen Treiber für meinen Adapter auf der Homepage von Asus gefunden.
schachjogi
Member
Member
Beiträge: 83
Registriert: 22. Mai 2004, 00:13

Beitrag von schachjogi »

Hi,
schau mal hier rein:
http://ndiswrapper.sourceforge.net/phpw ... onal%209.2
Gruß
Schachjogi
K4m1K4tz3
Advanced Hacker
Advanced Hacker
Beiträge: 987
Registriert: 19. Jan 2005, 13:54
Kontaktdaten:

Beitrag von K4m1K4tz3 »

Erstmal danke für die schnelle Hilfe, jedoch funktioniert das Tool nicht. Ich hab alles so gemacht wie auf der Seite beschrieben, leider kam jedoch diese Meldung:

hardware NOT present

Könnt Ihr mir noch was empfehlen?
K4m1K4tz3
Advanced Hacker
Advanced Hacker
Beiträge: 987
Registriert: 19. Jan 2005, 13:54
Kontaktdaten:

Beitrag von K4m1K4tz3 »

Hier nochmal was kommt wenn ich den Treiber installieren will (is etwas zu lang, ich weiß ...). Vielleicht kann mir dann jemand sagen was ich falsch mache:


-------- SiS162 Linux Configuration Script --------

Linux kernel source directory [/usr/src/linux-2.6.8-24-default]: /usr/src/linux/

./Configure: line 127: CONFIG_RELEASE: command not found
./Configure: line 127: CONFIG_CFGNAME: command not found
./Configure: line 127: shellecho-: command not found
The kernel source tree is version 2.6.8-.
WARNING: the current kernel is sublevel 2.6.8-24-default.
The current kernel build date is Wed Oct 6 09:16:23 2004.
Module install directory [/lib/modules/2.6.8-24-default]:

Choice install device (USB/PCI) [USB]: usb
Selected default USB device

expr: syntax error
./Configure: line 273: [: 131413: unary operator expected
Checking configuration output file...

Configuration successful.

Checking SiS162 linux driver source...


Compiling SiS162 modules...

gcc -D__KERNEL__ -Wstrict-prototypes -pipe -DMODULE -O2 -fomit-frame-pointer -DMODVERSIONS -DEXPORT_SYMTAB -include/usr/src/linux//include/linux/modversions.h -I./ -I../include/static -I../nsm -I/usr/src/linux//include -I../include -ffixed-8 -c -o release/sis.o release/sis.c
<command line>:138991965:55712: /usr/src/linux//include/linux/modversions.h: Nosuch file or directory
In file included from release/sis.c:21:
/usr/src/linux/include/linux/ac97_codec.h:218: error: field `list' has incomplete type
/usr/src/linux/include/linux/ac97_codec.h:247: error: parse error before "spinlock_t"
/usr/src/linux/include/linux/ac97_codec.h:247: warning: no semicolon at end of struct or union
/usr/src/linux/include/linux/ac97_codec.h:272: error: parse error before '}' token
/usr/src/linux/include/linux/ac97_codec.h:307: error: field `list' has incomplete type
release/sis.c:51:26: linux/tqueue.h: No such file or directory
release/sis.c:79:26: linux/tqueue.h: No such file or directory
In file included from /usr/src/linux/include/linux/irq.h:20,
from /usr/src/linux/include/asm/hardirq.h:6,
from /usr/src/linux/include/linux/hardirq.h:8,
from /usr/src/linux/include/linux/interrupt.h:11,
from /usr/src/linux/include/asm/highmem.h:24,
from /usr/src/linux/include/linux/highmem.h:14,
from /usr/src/linux/include/linux/skbuff.h:27,
from /usr/src/linux/include/linux/netdevice.h:156,
from release/sis.c:86:
/usr/src/linux/include/asm/irq.h:16:25: irq_vectors.h: No such file or directory
In file included from /usr/src/linux/include/asm/hardirq.h:6,
from /usr/src/linux/include/linux/hardirq.h:8,
from /usr/src/linux/include/linux/interrupt.h:11,
from /usr/src/linux/include/asm/highmem.h:24,
from /usr/src/linux/include/linux/highmem.h:14,
from /usr/src/linux/include/linux/skbuff.h:27,
from /usr/src/linux/include/linux/netdevice.h:156,
from release/sis.c:86:
/usr/src/linux/include/linux/irq.h:70: error: `NR_IRQS' undeclared here (not ina function)
In file included from /usr/src/linux/include/linux/irq.h:72,
from /usr/src/linux/include/asm/hardirq.h:6,
from /usr/src/linux/include/linux/hardirq.h:8,
from /usr/src/linux/include/linux/interrupt.h:11,
from /usr/src/linux/include/asm/highmem.h:24,
from /usr/src/linux/include/linux/highmem.h:14,
from /usr/src/linux/include/linux/skbuff.h:27,
from /usr/src/linux/include/linux/netdevice.h:156,
from release/sis.c:86:
/usr/src/linux/include/asm/hw_irq.h:28: error: `NR_IRQ_VECTORS' undeclared here(not in a function)
/usr/src/linux/include/asm/hw_irq.h:32: error: `NR_IRQS' undeclared here (not in a function)
release/sis.c:105: error: parse error before '*' token
release/sis.c:105: error: parse error before '*' token
release/sis.c:105: warning: function declaration isn't a prototype
release/sis.c:105: warning: data definition has no type or storage class
release/sis.c:106: error: parse error before '*' token
release/sis.c:106: warning: function declaration isn't a prototype
release/sis.c:107: error: parse error before '*' token
release/sis.c:107: warning: function declaration isn't a prototype
release/sis.c:108: error: parse error before '*' token
release/sis.c:108: warning: function declaration isn't a prototype
release/sis.c:204: warning: initialization from incompatible pointer type
release/sis.c:205: warning: initialization from incompatible pointer type
release/sis.c:250: warning: static declaration for `no_llseek' follows non-static
release/sis.c: In function `sis_request_irq':
release/sis.c:489: warning: passing arg 2 of `request_irq' from incompatible pointer type
release/sis.c: In function `sis_check_region':
release/sis.c:747: warning: `check_region' is deprecated (declared at /usr/src/linux/include/linux/ioport.h:121)
release/sis.c: In function `sis_pci_set_drvdata':
release/sis.c:997: error: structure has no member named `driver_data'
release/sis.c: In function `sis_pci_get_drvdata':
release/sis.c:1001: error: structure has no member named `driver_data'
release/sis.c: In function `sis_tq_init':
release/sis.c:1283: error: invalid application of `sizeof' to an incomplete type
release/sis.c: In function `sis_tq_set':
release/sis.c:1300: error: dereferencing pointer to incomplete type
release/sis.c:1301: error: dereferencing pointer to incomplete type
release/sis.c:1302: error: dereferencing pointer to incomplete type
release/sis.c: In function `sis_queue_task':
release/sis.c:1308: error: `tq_immediate' undeclared (first use in this function)
release/sis.c:1308: error: (Each undeclared identifier is reported only once
release/sis.c:1308: error: for each function it appears in.)
release/sis.c: In function `sis_run_task_queue':
release/sis.c:1312: error: `tq_immediate' undeclared (first use in this function)
release/sis.c: In function `sis_mark_bh':
release/sis.c:1316: error: `IMMEDIATE_BH' undeclared (first use in this function)
release/sis.c: In function `sis_set_thread':
release/sis.c:2013: error: too few arguments to function `daemonize'
release/sis.c: At top level:
release/sis.c:2127: warning: static declaration for `sis_usb_start_wait_urb' follows non-static
release/sis.c: In function `sis_usb_start_wait_urb':
release/sis.c:2174: error: storage size of `awd' isn't known
release/sis.c:2184: error: too few arguments to function `usb_submit_urb'
release/sis.c: In function `ctrlcomplete':
release/sis.c:2232: error: `USB_ST_NOERROR' undeclared (first use in this function)
release/sis.c:2235: error: `USB_ST_STALL' undeclared (first use in this function)
release/sis.c:2239: error: `USB_ST_TIMEOUT' undeclared (first use in this function)
release/sis.c:2250: error: dereferencing pointer to incomplete type
release/sis.c:2251: error: dereferencing pointer to incomplete type
release/sis.c: In function `sis_usb_set_configuration':
release/sis.c:2362: error: structure has no member named `bConfigurationValue'
release/sis.c: In function `sis_call_usermodehelper':
release/sis.c:2391: error: too few arguments to function `call_usermodehelper'
make: *** [release/sis.o] Error 1
Compile ./release/sis.o failed !

SiS162 module install failed !

linux:/home/User/SiS162-Driver #
Antworten