der versuch eines make von ieee80211-1.0.1

Alles rund um die Systemverwaltung, die Administration und Konfiguration Eures Linuxsystems

Moderator: Moderatoren

Antworten
Benutzeravatar
anti43
Newbie
Newbie
Beiträge: 7
Registriert: 1. Jul 2004, 19:52
Wohnort: Perl
Kontaktdaten:

der versuch eines make von ieee80211-1.0.1

Beitrag von anti43 » 26. Sep 2005, 15:22

hiiiilfe!
beim versuch eines make von ieee80211-1.0.1 (ein modul, das vom bg2200-treiber benötigt wird (centrino wlan), kommt folgende meldung (und ich verzweifle), zu der ich einfach keinen lösungansatz finden kann. bitte helft mir!




linux:/home/anti//ieee80211-1.0.1 # make
Checking in /lib/modules/2.6.13-9-default/build/ for ieee80211 components...

make -C /lib/modules/2.6.13-9-default/build M=/home/anti/ieee80211-1.0.1/ieee80211-1.0.1 MODVERDIR=/home/anti/ieee80211-1.0.1/ieee80211-1.0.1 modules
make[1]: Entering directory `/usr/src/linux-2.6.13-9-obj/i386/default'
make -C ../../../linux-2.6.13-9 O=../linux-2.6.13-9-obj/i386/default modules
CC [M] /home/anti/ieee80211-1.0.1/ieee80211-1.0.1/ieee80211_module.o
/home/anti/ieee80211-1.0.1/ieee80211-1.0.1/ieee80211_module.c:61: error: syntax error before ‘IEEE80211_VERSION’
/home/anti/ieee80211-1.0.1/ieee80211-1.0.1/ieee80211_module.c: In function ‘alloc_ieee80211’:
/home/anti/ieee80211-1.0.1/ieee80211-1.0.1/ieee80211_module.c:145: error: ‘ieee80211_crypt_deinit_handler’ undeclared (first use in this function)
/home/anti/ieee80211-1.0.1/ieee80211-1.0.1/ieee80211_module.c:145: error: (Each undeclared identifier is reported only once
/home/anti/ieee80211-1.0.1/ieee80211-1.0.1/ieee80211_module.c:145: error: for each function it appears in.)
/home/anti/ieee80211-1.0.1/ieee80211-1.0.1/ieee80211_module.c:146: error: ‘struct ieee80211_device’ has no member named ‘crypt_quiesced’
/home/anti/ieee80211-1.0.1/ieee80211-1.0.1/ieee80211_module.c: In function ‘free_ieee80211’:
/home/anti/ieee80211-1.0.1/ieee80211-1.0.1/ieee80211_module.c:171: error: implicit declaration of function ‘ieee80211_crypt_quiescing’
/home/anti/ieee80211-1.0.1/ieee80211-1.0.1/ieee80211_module.c:173: error: implicit declaration of function ‘ieee80211_crypt_deinit_entries’
/home/anti/ieee80211-1.0.1/ieee80211-1.0.1/ieee80211_module.c:178: error: dereferencing pointer to incomplete type
/home/anti/ieee80211-1.0.1/ieee80211-1.0.1/ieee80211_module.c:179: error: dereferencing pointer to incomplete type
/home/anti/ieee80211-1.0.1/ieee80211-1.0.1/ieee80211_module.c:179: error: dereferencing pointer to incomplete type
/home/anti/ieee80211-1.0.1/ieee80211-1.0.1/ieee80211_module.c:180: error: dereferencing pointer to incomplete type
/home/anti/ieee80211-1.0.1/ieee80211-1.0.1/ieee80211_module.c: In function ‘ieee80211_init’:
/home/anti/ieee80211-1.0.1/ieee80211-1.0.1/ieee80211_module.c:255: error: syntax error before ‘IEEE80211_VERSION’
make[4]: *** [/home/anti/ieee80211-1.0.1/ieee80211-1.0.1/ieee80211_module.o] Fehler 1
make[3]: *** [_module_/home/anti/ieee80211-1.0.1/ieee80211-1.0.1] Fehler 2
make[2]: *** [modules] Fehler 2
make[1]: *** [modules] Fehler 2
make[1]: Leaving directory `/usr/src/linux-2.6.13-9-obj/i386/default'
make: *** [modules] Fehler 2
http://www.cds-server.de -> kostenlose Rechnungsverwaltung MP
http://www.jobs-in-trier.de -> Studentenjobs und Nebenjobs in Trier

Werbung:
Freecoffee
Guru
Guru
Beiträge: 1750
Registriert: 29. Sep 2004, 17:00
Wohnort: Bayern

Beitrag von Freecoffee » 26. Sep 2005, 18:40

Warum nimmst du nicht das aktuelle ieee80211 1.0.3? Das gibt es unter ieee80211.sf.net.

Greetz, HB

Benutzeravatar
anti43
Newbie
Newbie
Beiträge: 7
Registriert: 1. Jul 2004, 19:52
Wohnort: Perl
Kontaktdaten:

Beitrag von anti43 » 26. Sep 2005, 18:48

weil ich damit den gleichen fehler habe.. hab das vergessen zu erwähnen
http://www.cds-server.de -> kostenlose Rechnungsverwaltung MP
http://www.jobs-in-trier.de -> Studentenjobs und Nebenjobs in Trier

Antworten

Wer ist online?

Mitglieder in diesem Forum: 0 Mitglieder und 1 Gast