Diese Website existiert nur weil wir Werbung mit AdSense ausliefern.
Bitte den AdBlocker daher auf dieser Website ausschalten! Danke.

[gelöst] error: no such partition

Alles rund um die Systemverwaltung, die Administration und Konfiguration Eures Linuxsystems

Moderator: Moderatoren

Antworten
Benutzeravatar
Heinz-Peter
Guru
Guru
Beiträge: 2234
Registriert: 24. Okt 2005, 14:04

[gelöst] error: no such partition

Beitrag von Heinz-Peter » 16. Jun 2020, 20:22

Hallo Forum,

mein Ubuntu 16.04 LTS hat sich heute aufgehängt.
Was habe ich gemacht?
Ich habe meinen alten Desktop PC hochgefahren.
Dann habe ich Browser Firefox gestartet.
Ja, und dann ging nichts, das Bild wie eingefroren, Tastatur und Maus keine Reaktion. Strg+Alt+F1ging auch nicht.

Also habe ich den Ein/Aus gedrückt und Neustart gemacht. Hat zuerst auch funktioniert aber Firefox hat sich wieder aufgehängt. Also das Gleiche von vorne Ein/Aus Knopf und jetzt nach den BIOS Meldungen (kein UEFI) hatte ich folgende Meldung bekommen:

Code: Alles auswählen

 error: no such partition
grub rescue>
Mit 'grub rescue' konnte ich aus Wissensmangel nichts anfangen :)

Also habe ich die Ubuntu DVD in Laufwerk eingeschoben und Memtest gemacht. Der meldete mir ca. 4000 Errors. Zuerst dachte ich, mein alter Speicher ist defekt, aber nach einem Neustart läuft die Kiste wieder.
Die Konsoleausgabe smartctl sagt auch nichts böses

Code: Alles auswählen

# smartctl -H /dev/sda
smartctl 6.3 2014-07-26 r3976 [i686-linux-3.16.7-53-default] (SUSE RPM)
Copyright (C) 2002-14, Bruce Allen, Christian Franke, www.smartmontools.org

=== START OF READ SMART DATA SECTION ===
SMART overall-health self-assessment test result: PASSED
Please note the following marginal Attributes:
ID# ATTRIBUTE_NAME          FLAG     VALUE WORST THRESH TYPE      UPDATED  WHEN_FAILED RAW_VALUE
190 Airflow_Temperature_Cel 0x0022   069   045   045    Old_age   Always   In_the_past 31

Code: Alles auswählen

#  smartctl -a /dev/sda
smartctl 6.3 2014-07-26 r3976 [i686-linux-3.16.7-53-default] (SUSE RPM)
Copyright (C) 2002-14, Bruce Allen, Christian Franke, www.smartmontools.org

=== START OF INFORMATION SECTION ===
Model Family:     Western Digital Caviar SE Serial ATA
Device Model:     WDC WD2500JS-00NCB1
Serial Number:    WD-WCANK8579745
Firmware Version: 10.02E02
User Capacity:    250.059.350.016 bytes [250 GB]
Sector Size:      512 bytes logical/physical
Device is:        In smartctl database [for details use: -P show]
ATA Version is:   ATA/ATAPI-7 (minor revision not indicated)
Local Time is:    Tue Jun 16 17:35:31 2020 CEST
SMART support is: Available - device has SMART capability.
SMART support is: Enabled

=== START OF READ SMART DATA SECTION ===
SMART overall-health self-assessment test result: PASSED
See vendor-specific Attribute list for marginal Attributes.

General SMART Values:
Offline data collection status:  (0x82) Offline data collection activity
                                        was completed without error.
                                        Auto Offline Data Collection: Enabled.
Self-test execution status:      (   0) The previous self-test routine completed
                                        without error or no self-test has ever 
                                        been run.
Total time to complete Offline 
data collection:                ( 7680) seconds.
Offline data collection
capabilities:                    (0x7b) SMART execute Offline immediate.
                                        Auto Offline data collection on/off support.
                                        Suspend Offline collection upon new
                                        command.
                                        Offline surface scan supported.
                                        Self-test supported.
                                        Conveyance Self-test supported.
                                        Selective Self-test supported.
SMART capabilities:            (0x0003) Saves SMART data before entering
                                        power-saving mode.
                                        Supports SMART auto save timer.
Error logging capability:        (0x01) Error logging supported.
                                        General Purpose Logging supported.
Short self-test routine 
recommended polling time:        (   2) minutes.
Extended self-test routine
recommended polling time:        (  90) minutes.
Conveyance self-test routine
recommended polling time:        (   6) minutes.
SCT capabilities:              (0x103f) SCT Status supported.
                                        SCT Error Recovery Control supported.
                                        SCT Feature Control supported.
                                        SCT Data Table supported.

SMART Attributes Data Structure revision number: 16
Vendor Specific SMART Attributes with Thresholds:
ID# ATTRIBUTE_NAME          FLAG     VALUE WORST THRESH TYPE      UPDATED  WHEN_FAILED RAW_VALUE
  1 Raw_Read_Error_Rate     0x000f   200   199   051    Pre-fail  Always       -       1336
  3 Spin_Up_Time            0x0003   242   185   021    Pre-fail  Always       -       2858
  4 Start_Stop_Count        0x0032   093   093   000    Old_age   Always       -       7996
  5 Reallocated_Sector_Ct   0x0033   200   200   140    Pre-fail  Always       -       0
  7 Seek_Error_Rate         0x000f   200   200   051    Pre-fail  Always       -       0
  9 Power_On_Hours          0x0032   076   076   000    Old_age   Always       -       17846
 10 Spin_Retry_Count        0x0013   100   100   051    Pre-fail  Always       -       0
 11 Calibration_Retry_Count 0x0012   100   100   051    Old_age   Always       -       0
 12 Power_Cycle_Count       0x0032   093   093   000    Old_age   Always       -       7949
190 Airflow_Temperature_Cel 0x0022   065   045   045    Old_age   Always   In_the_past 35
194 Temperature_Celsius     0x0022   115   095   000    Old_age   Always       -       35
196 Reallocated_Event_Count 0x0032   200   200   000    Old_age   Always       -       0
197 Current_Pending_Sector  0x0012   200   200   000    Old_age   Always       -       0
198 Offline_Uncorrectable   0x0010   200   200   000    Old_age   Offline      -       0
199 UDMA_CRC_Error_Count    0x003e   200   200   000    Old_age   Always       -       17
200 Multi_Zone_Error_Rate   0x0009   200   200   051    Pre-fail  Offline      -       0

SMART Error Log Version: 1
ATA Error Count: 1336 (device log contains only the most recent five errors)
        CR = Command Register [HEX]
        FR = Features Register [HEX]
        SC = Sector Count Register [HEX]
        SN = Sector Number Register [HEX]
        CL = Cylinder Low Register [HEX]
        CH = Cylinder High Register [HEX]
        DH = Device/Head Register [HEX]
        DC = Device Command Register [HEX]
        ER = Error register [HEX]
        ST = Status register [HEX]
Powered_Up_Time is measured from power on, and printed as
DDd+hh:mm:SS.sss where DD=days, hh=hours, mm=minutes,
SS=sec, and sss=millisec. It "wraps" after 49.710 days.

Error 1336 occurred at disk power-on lifetime: 4940 hours (205 days + 20 hours)
  When the command that caused the error occurred, the device was active or idle.

  After command completion occurred, registers were:
  ER ST SC SN CL CH DH
  -- -- -- -- -- -- --
  40 51 01 74 21 29 e0  Error: UNC 1 sectors at LBA = 0x00292174 = 2695540

  Commands leading to the command that caused the error were:
  CR FR SC SN CL CH DH DC   Powered_Up_Time  Command/Feature_Name
  -- -- -- -- -- -- -- --  ----------------  --------------------
  25 00 01 74 21 29 01 00      03:27:41.158  READ DMA EXT
  25 00 01 73 21 29 01 00      03:27:41.158  READ DMA EXT
  25 00 01 72 21 29 01 00      03:27:41.158  READ DMA EXT
  25 00 01 71 21 29 01 00      03:27:41.158  READ DMA EXT
  25 00 01 70 21 29 01 00      03:27:41.158  READ DMA EXT

Error 1335 occurred at disk power-on lifetime: 4940 hours (205 days + 20 hours)
  When the command that caused the error occurred, the device was active or idle.

  After command completion occurred, registers were:
  ER ST SC SN CL CH DH
  -- -- -- -- -- -- --
  40 51 00 00 21 29 e0  Error: UNC at LBA = 0x00292100 = 2695424

  Commands leading to the command that caused the error were:
  CR FR SC SN CL CH DH DC   Powered_Up_Time  Command/Feature_Name
  -- -- -- -- -- -- -- --  ----------------  --------------------
  25 00 00 00 21 29 01 00      03:27:39.092  READ DMA EXT
  25 00 00 00 20 29 01 00      03:27:39.090  READ DMA EXT
  25 00 00 00 1f 29 01 00      03:27:39.088  READ DMA EXT
  25 00 00 00 1e 29 01 00      03:27:39.085  READ DMA EXT
  25 00 00 00 1d 29 01 00      03:27:39.084  READ DMA EXT

Error 1334 occurred at disk power-on lifetime: 4937 hours (205 days + 17 hours)
  When the command that caused the error occurred, the device was active or idle.

  After command completion occurred, registers were:
  ER ST SC SN CL CH DH
  -- -- -- -- -- -- --
  40 51 40 5a 21 29 e0  Error: UNC 64 sectors at LBA = 0x0029215a = 2695514

  Commands leading to the command that caused the error were:
  CR FR SC SN CL CH DH DC   Powered_Up_Time  Command/Feature_Name
  -- -- -- -- -- -- -- --  ----------------  --------------------
  25 00 40 5a 21 29 01 00      00:09:11.372  READ DMA EXT
  25 00 40 1a 21 29 01 00      00:09:11.372  READ DMA EXT
  25 00 40 da 20 29 01 00      00:09:11.371  READ DMA EXT
  25 00 40 9a 20 29 01 00      00:09:11.371  READ DMA EXT
  25 00 40 5a 20 29 01 00      00:09:11.371  READ DMA EXT

Error 1333 occurred at disk power-on lifetime: 2474 hours (103 days + 2 hours)
  When the command that caused the error occurred, the device was active or idle.

  After command completion occurred, registers were:
  ER ST SC SN CL CH DH
  -- -- -- -- -- -- --
  40 51 08 6f 21 29 e0  Error: UNC 8 sectors at LBA = 0x0029216f = 2695535

  Commands leading to the command that caused the error were:
  CR FR SC SN CL CH DH DC   Powered_Up_Time  Command/Feature_Name
  -- -- -- -- -- -- -- --  ----------------  --------------------
  25 00 08 6f 21 29 01 00      00:04:04.613  READ DMA EXT
  35 00 08 d7 00 00 00 00      00:04:04.613  WRITE DMA EXT
  25 00 01 59 1f 80 07 00      00:04:04.613  READ DMA EXT
  35 00 08 af 71 98 04 00      00:04:04.613  WRITE DMA EXT
  25 00 2a b7 b1 69 04 00      00:04:04.613  READ DMA EXT

Error 1332 occurred at disk power-on lifetime: 2474 hours (103 days + 2 hours)
  When the command that caused the error occurred, the device was active or idle.

  After command completion occurred, registers were:
  ER ST SC SN CL CH DH
  -- -- -- -- -- -- --
  40 51 08 6f 21 29 e0  Error: UNC 8 sectors at LBA = 0x0029216f = 2695535

  Commands leading to the command that caused the error were:
  CR FR SC SN CL CH DH DC   Powered_Up_Time  Command/Feature_Name
  -- -- -- -- -- -- -- --  ----------------  --------------------
  25 00 08 6f 21 29 01 00      00:04:02.675  READ DMA EXT
  35 00 30 07 3f 01 00 00      00:04:02.674  WRITE DMA EXT
  25 00 01 00 00 00 00 00      00:04:02.674  READ DMA EXT
  35 00 08 37 6f 98 04 00      00:04:02.674  WRITE DMA EXT
  35 00 08 9f 1e 5f 04 00      00:04:02.674  WRITE DMA EXT

SMART Self-test log structure revision number 1
Num  Test_Description    Status                  Remaining  LifeTime(hours)  LBA_of_first_error
# 1  Short offline       Completed without error       00%     16730         -
# 2  Short offline       Completed without error       00%     12669         -
# 3  Short offline       Completed without error       00%      4940         -
# 4  Short offline       Completed without error       00%        11         -

SMART Selective self-test log data structure revision number 1
 SPAN  MIN_LBA  MAX_LBA  CURRENT_TEST_STATUS
    1        0        0  Not_testing
    2        0        0  Not_testing
    3        0        0  Not_testing
    4        0        0  Not_testing
    5        0        0  Not_testing
Selective self-test flags (0x0):
  After scanning selected spans, do NOT read-scan remainder of disk.
If Selective self-test is pending on power-up, resume after 0 minute delay.
Hat jemand eine Idee?
FP oder Speicher, eventuell ein Wackelkontakt?

Grüße

Heinz-Peter
Zuletzt geändert von Heinz-Peter am 17. Jun 2020, 18:45, insgesamt 1-mal geändert.
Wir müssen lernen, entweder als Brüder miteinander zu leben oder als Narren unterzugehen.
Mein Betriebssystem: Suse 42.2/42.3, Prozessor: Pentium 4 550 (3,40 GHz, FSB800, Hyper-Threading), Grafikkarte: Nvidia Geforce 6610XL (PCIe)/128MByte.

Werbung:
Benutzeravatar
manzek
Hacker
Hacker
Beiträge: 291
Registriert: 20. Mär 2005, 14:21
Wohnort: Metropolregion Bremen/Oldenburg

Re: error: no such partition

Beitrag von manzek » 16. Jun 2020, 21:19

Hallo Heinz-Peter,

da die Fehlermeldung bereits auf eine nicht gefundene Partition hindeutet, würde ich auch in der Richtung suchen.
Versuche mal, die SATA-Kabel auszutauschen. Bevor du jetzt aber neue Kabel kaufen musst, kannst du ja mal intern durchtauschen; z.B. Festplatte gegen DVD-Laufwerk. Oder aber schauen, was die Grabbelkiste noch so hergibt... :D
So long, Stephan

---
Gigabyte Z77X-D3H * Intel i7-3770K LCS @ 4,2 GHz * 16 GB DDR3 @ 1866 MHz * nVIDIA GeForce RTX 2070 SUPER, 8192 MB * 23,6" - LED @ 1920x1080 * openSUSE Leap 15.1 * KDE 5.12.x

josef-wien
Ultimate Guru
Ultimate Guru
Beiträge: 5422
Registriert: 23. Sep 2008, 17:09

Re: error: no such partition

Beitrag von josef-wien » 16. Jun 2020, 22:14

Heinz-Peter hat geschrieben:Memtest gemacht. Der meldete mir ca. 4000 Errors
Das solltest Du nicht ignorieren.


Heinz-Peter hat geschrieben:

Code: Alles auswählen

1 Raw_Read_Error_Rate     0x000f   200   199   051    Pre-fail  Always       -       1336
9 Power_On_Hours          0x0032   076   076   000    Old_age   Always       -       17846
Error 1336 occurred at disk power-on lifetime: 4940 hours
Der letzte Fehler war vor 12.906 Betriebsstunden.

Benutzeravatar
Heinz-Peter
Guru
Guru
Beiträge: 2234
Registriert: 24. Okt 2005, 14:04

Re: error: no such partition

Beitrag von Heinz-Peter » 17. Jun 2020, 17:15

manzek hat geschrieben:
16. Jun 2020, 21:19
da die Fehlermeldung bereits auf eine nicht gefundene Partition hindeutet, würde ich auch in der Richtung suchen.
Versuche mal, die SATA-Kabel auszutauschen. Bevor du jetzt aber neue Kabel kaufen musst, kannst du ja mal intern durchtauschen; z.B. Festplatte gegen DVD-Laufwerk. Oder aber schauen, was die Grabbelkiste noch so hergibt... :D
Danke für dein Tipp. Falls ich die Kiste aufmachen muss werde ich testen.


josef-wien hat geschrieben:
16. Jun 2020, 22:14
Heinz-Peter hat geschrieben:Memtest gemacht. Der meldete mir ca. 4000 Errors
Das solltest Du nicht ignorieren.


Heinz-Peter hat geschrieben:

Code: Alles auswählen

1 Raw_Read_Error_Rate     0x000f   200   199   051    Pre-fail  Always       -       1336
9 Power_On_Hours          0x0032   076   076   000    Old_age   Always       -       17846
Error 1336 occurred at disk power-on lifetime: 4940 hours
Der letzte Fehler war vor 12.906 Betriebsstunden.
Interessant, was Du hier ausgerechnet hast. Ist meine Rechnung unten richtig?
Power_On_Hours (Einschaltstunden) 17846 - 4940 (Fehler 1336 trat beim Einschalten der Festplatte nach: 4940 Stunden)
17846 - 4940 = 12906

Wenn die Rechnung stimmt dann ist nicht die Festplatte die Fehler Quelle. Nach dem Einschalten sucht BIOS die vorhandene Hardware, also Arbeitsspeicher, Festplatte, CPU, Mainboard. Findet er nicht was er sucht dann ertönen Pieptöne. Das war bei mir nicht der Fall. Bei mir wurde Grub Legacy von MBR der Festplatte gelesen und dann ...? Hier bin ich mir nicht sicher. Kann es sein, das eine Grub Stage wurde in den fehlerhaften Arbeitsspeicher geladen und findet dann nicht die folgende Stage? Der Fehler wurde dann eher am Arbeitsspeicher liegen.

Danke für Eure Hilfe

Heinz-Peter
Wir müssen lernen, entweder als Brüder miteinander zu leben oder als Narren unterzugehen.
Mein Betriebssystem: Suse 42.2/42.3, Prozessor: Pentium 4 550 (3,40 GHz, FSB800, Hyper-Threading), Grafikkarte: Nvidia Geforce 6610XL (PCIe)/128MByte.

Benutzeravatar
manzek
Hacker
Hacker
Beiträge: 291
Registriert: 20. Mär 2005, 14:21
Wohnort: Metropolregion Bremen/Oldenburg

Re: error: no such partition

Beitrag von manzek » 17. Jun 2020, 17:53

Da reichen ebenfalls leicht korrodierte Kontakte, dass ein RAM-Modul Ärger macht. Auch hier einfach mal die Module aus- und wieder einbauen.
So long, Stephan

---
Gigabyte Z77X-D3H * Intel i7-3770K LCS @ 4,2 GHz * 16 GB DDR3 @ 1866 MHz * nVIDIA GeForce RTX 2070 SUPER, 8192 MB * 23,6" - LED @ 1920x1080 * openSUSE Leap 15.1 * KDE 5.12.x

Benutzeravatar
Heinz-Peter
Guru
Guru
Beiträge: 2234
Registriert: 24. Okt 2005, 14:04

Re: error: no such partition

Beitrag von Heinz-Peter » 17. Jun 2020, 18:42

manzek hat geschrieben:
17. Jun 2020, 17:53
Da reichen ebenfalls leicht korrodierte Kontakte, dass ein RAM-Modul Ärger macht. Auch hier einfach mal die Module aus- und wieder einbauen.
Ja, das hatte ich schon vor paar Jahren. Damals hatte sich der BIOS per Pieptöne bemerkbar gemacht. Habe dann die Module gezogen und wieder eingesteckt. Das alleine hat schon geholfen. Diesmal hatte ich aber eine Error Meldung bekommen über eine defekte Partition. Das hat mich irritiert.
Wir müssen lernen, entweder als Brüder miteinander zu leben oder als Narren unterzugehen.
Mein Betriebssystem: Suse 42.2/42.3, Prozessor: Pentium 4 550 (3,40 GHz, FSB800, Hyper-Threading), Grafikkarte: Nvidia Geforce 6610XL (PCIe)/128MByte.

Antworten